Ticket #38: leocad_SVNtrunk_ubuntu_7.10_amd64_build_failure.txt

File leocad_SVNtrunk_ubuntu_7.10_amd64_build_failure.txt, 2.8 KB (added by me.yahoo.com/a/ra8b8s0muolekq72mhmldlbt1erlxq--, 8 years ago)
Line 
1$ make config
2Automatic configuration
3checking size of char... 1
4checking size of short... 2
5checking size of long... 8
6checking size of int... 4
7checking size of void *... 8
8checking size of long long... 8
9Determining endianess... little endian
10Checking if GLIB and GTK+ are installed... ok
11Checking for jpeg support... no (libjpeg optional)
12Checking for zlib support... no (zlib optional)
13Checking for png support... no (libpng optional)
14
15$ make
16g++ -DPNG_NO_MMX_CODE -I/usr/include/gtk-2.0 -I/usr/lib/gtk-2.0/include -I/usr/include/atk-1.0 -I/usr/include/cairo -I/usr/include/pango-1.0 -I/usr/include/glib-2.0 -I/usr/lib/glib-2.0/include -I/usr/include/freetype2 -I/usr/include/libpng12   -O2 -Wall -Ilinux -Icommon -DLC_LINUX -g -include linux/config.h  -c -o linux/profile.o linux/profile.cpp
17g++ -DPNG_NO_MMX_CODE -I/usr/include/gtk-2.0 -I/usr/lib/gtk-2.0/include -I/usr/include/atk-1.0 -I/usr/include/cairo -I/usr/include/pango-1.0 -I/usr/include/glib-2.0 -I/usr/lib/glib-2.0/include -I/usr/include/freetype2 -I/usr/include/libpng12   -O2 -Wall -Ilinux -Icommon -DLC_LINUX -g -include linux/config.h  -c -o linux/dialogs.o linux/dialogs.cpp
18common/lc_array.h: In member function ‘void lcPtrArray<T>::AddSorted(T*, int (*)(const T*, const T*, void*), void*)’:
19common/lc_array.h:76: error: ‘Data’ was not declared in this scope
20common/lc_array.h:78: error: ‘Obj’ was not declared in this scope
21linux/dialogs.cpp: In function ‘int propertiesdlg_execute(void*)’:
22linux/dialogs.cpp:2392: error: ‘LC_MAXCOLORS’ was not declared in this scope
23linux/dialogs.cpp:2393: error: ‘totalcount’ was not declared in this scope
24linux/dialogs.cpp:2394: error: ‘struct LC_PROPERTIESDLG_OPTS’ has no member named ‘lines’
25linux/dialogs.cpp:2396: error: ‘struct LC_PROPERTIESDLG_OPTS’ has no member named ‘count’
26linux/dialogs.cpp:2424: error: ‘col’ was not declared in this scope
27linux/dialogs.cpp:2426: error: ‘colornames’ was not declared in this scope
28linux/dialogs.cpp:2437: error: ‘row’ was not declared in this scope
29linux/dialogs.cpp:2439: error: ‘struct LC_PROPERTIESDLG_OPTS’ has no member named ‘lines’
30linux/dialogs.cpp:2444: error: ‘struct LC_PROPERTIESDLG_OPTS’ has no member named ‘count’
31linux/dialogs.cpp:2449: error: ‘row’ was not declared in this scope
32linux/dialogs.cpp:2449: error: ‘struct LC_PROPERTIESDLG_OPTS’ has no member named ‘names’
33linux/dialogs.cpp:2454: error: ‘struct LC_PROPERTIESDLG_OPTS’ has no member named ‘count’
34linux/dialogs.cpp:2455: error: ‘col’ was not declared in this scope
35linux/dialogs.cpp:2455: error: ‘struct LC_PROPERTIESDLG_OPTS’ has no member named ‘count’
36linux/dialogs.cpp:2462: error: ‘row’ was not declared in this scope
37linux/dialogs.cpp:2468: error: ‘col’ was not declared in this scope
38make: *** [linux/dialogs.o] Error 1
39